Target
Histamine H1 receptor
Ligand
BDBM50297306
Substrate
Meas. Tech.
ChEMBL_582981 (CHEMBL1051819)
Ki
11±n/a nM
Citation
 Moree, WJLi, BFJovic, FCoon, TYu, JGross, RSTucci, FMarinkovic, DZamani-Kord, SMalany, SBradbury, MJHernandez, LMO'Brien, ZWen, JWang, HHoare, SRPetroski, RESacaan, AMadan, ACrowe, PDBeaton, G Characterization of novel selective H1-antihistamines for clinical evaluation in the treatment of insomnia. J Med Chem 52:5307-10 (2009)  
Target
Name:
Histamine H1 receptor
Synonyms:
H1R HISTAMINE H1 HRH1_HUMAN
Type:
G Protein-Coupled Receptor (GPCR)
Mol. Mass.:
55808.72
Organism:
Homo sapiens (Human)
Description:
Cell pellets from SK-N-MC cells transfected with human H1 receptor were used in binding assay.
Residue:
487
  
Inhibitor
Name:
BDBM50297306
Synonyms:
CHEMBL540982 | {2-[3-(4-Fluoro-benzyl)-benzo[b]thiophen-2-yl]-ethyl}-dimethyl-amine
Type:
Small organic molecule
Emp. Form.:
C19H20FNS
Mol. Mass.:
313.432
SMILES:
CN(C)CCc1sc2ccccc2c1Cc1ccc(F)cc1
: