Target
Muscarinic acetylcholine receptor M1
Ligand
BDBM50297306
Substrate
Meas. Tech.
ChEMBL_582982 (CHEMBL1051820)
Ki
2±n/a nM
Citation
 Moree, WJLi, BFJovic, FCoon, TYu, JGross, RSTucci, FMarinkovic, DZamani-Kord, SMalany, SBradbury, MJHernandez, LMO'Brien, ZWen, JWang, HHoare, SRPetroski, RESacaan, AMadan, ACrowe, PDBeaton, G Characterization of novel selective H1-antihistamines for clinical evaluation in the treatment of insomnia. J Med Chem 52:5307-10 (2009)  
Target
Name:
Muscarinic acetylcholine receptor M1
Synonyms:
ACM1_HUMAN Cholinergic receptor, muscarinic 1 | Cholinergic, muscarinic M1
Type:
Protein
Mol. Mass.:
51442.54
Organism:
Homo sapiens (Human)
Description:
P11229
Residue:
460
  
Inhibitor
Name:
BDBM50297306
Synonyms:
CHEMBL540982 | {2-[3-(4-Fluoro-benzyl)-benzo[b]thiophen-2-yl]-ethyl}-dimethyl-amine
Type:
Small organic molecule
Emp. Form.:
C19H20FNS
Mol. Mass.:
313.432
SMILES:
CN(C)CCc1sc2ccccc2c1Cc1ccc(F)cc1
: