Target
Mitogen-activated protein kinase 10
Ligand
BDBM50297485
Substrate
Meas. Tech.
ChEMBL_586022 (CHEMBL1063579)
Ki
5000±n/a nM
Citation
 Cao, JGao, HBemis, GSalituro, FLedeboer, MHarrington, EWilke, STaslimi, PPazhanisamy, SXie, XJacobs, MGreen, J Structure-based design and parallel synthesis of N-benzyl isatin oximes as JNK3 MAP kinase inhibitors. Bioorg Med Chem Lett 19:2891-5 (2009)  
Target
Name:
Mitogen-activated protein kinase 10
Synonyms:
JNK3 MAP kinase p49 3F12 MK10_HUMAN Mitogen-activated protein kinase 10 (Stress-activated protein kinase JNK3) (c-Jun N-terminal kinase 3) (MAP kinase p49 3F12) PRKM10 Stress-activated protein kinase JNK3 | c-Jun N-terminal kinase 3 (JNK3)
Type:
Enzyme
Mol. Mass.:
52586.89
Organism:
Homo sapiens (Human)
Description:
Residue:
464
  
Inhibitor
Name:
BDBM50297485
Synonyms:
1-(3-chlorobenzyl)-3-(hydroxyimino)indolin-2-one | CHEMBL561403
Type:
Small organic molecule
Emp. Form.:
C15H11ClN2O2
Mol. Mass.:
286.713
SMILES:
Clc1cccc(CN2C(=O)C(N=O)c3ccccc23)c1
: