Target
Mitogen-activated protein kinase 14
Ligand
BDBM50297457
Substrate
Meas. Tech.
ChEMBL_586023 (CHEMBL1063580)
Ki
8000±n/a nM
Citation
 Cao, JGao, HBemis, GSalituro, FLedeboer, MHarrington, EWilke, STaslimi, PPazhanisamy, SXie, XJacobs, MGreen, J Structure-based design and parallel synthesis of N-benzyl isatin oximes as JNK3 MAP kinase inhibitors. Bioorg Med Chem Lett 19:2891-5 (2009)  
Target
Name:
Mitogen-activated protein kinase 14
Synonyms:
CSAID-binding protein CSBP1 CSPB1 MAP kinase 14 MAP kinase p38 alpha MAPK14 MK14_HUMAN Mitogen-activated protein kinase p38 alpha Stress-activated protein kinase 2a | p38 MAP kinase alpha/beta
Type:
Serine/threonine-protein kinase
Mol. Mass.:
41286.76
Organism:
Homo sapiens (Human)
Description:
Q16539
Residue:
360
  
Inhibitor
Name:
BDBM50297457
Synonyms:
1-((6-fluoro-4H-benzo[d][1,3]dioxin-8-yl)methyl)-3-(hydroxyimino)-4-vinylindolin-2-one | CHEMBL564389
Type:
Small organic molecule
Emp. Form.:
C19H15FN2O4
Mol. Mass.:
354.3318
SMILES:
Fc1cc(CN2C(=O)C(N=O)c3c2cccc3C=C)c2OCOCc2c1
: