Target
Mitogen-activated protein kinase 14
Ligand
BDBM50297480
Substrate
Meas. Tech.
ChEMBL_586023 (CHEMBL1063580)
Ki
9500±n/a nM
Citation
 Cao, JGao, HBemis, GSalituro, FLedeboer, MHarrington, EWilke, STaslimi, PPazhanisamy, SXie, XJacobs, MGreen, J Structure-based design and parallel synthesis of N-benzyl isatin oximes as JNK3 MAP kinase inhibitors. Bioorg Med Chem Lett 19:2891-5 (2009)  
Target
Name:
Mitogen-activated protein kinase 14
Synonyms:
CSAID-binding protein CSBP1 CSPB1 MAP kinase 14 MAP kinase p38 alpha MAPK14 MK14_HUMAN Mitogen-activated protein kinase p38 alpha Stress-activated protein kinase 2a | p38 MAP kinase alpha/beta
Type:
Serine/threonine-protein kinase
Mol. Mass.:
41286.76
Organism:
Homo sapiens (Human)
Description:
Q16539
Residue:
360
  
Inhibitor
Name:
BDBM50297480
Synonyms:
(3Z)-1-[(6-fluoro-4H-1,3-benzodioxin-8-yl)methyl]-4-phenyl-1H-indole-2,3-dione 3-oxime CHEMBL549385
Type:
Small organic molecule
Emp. Form.:
C23H17FN2O4
Mol. Mass.:
404.3905
SMILES:
Fc1cc(CN2C(=O)C(N=O)c3c2cccc3-c2ccccc2)c2OCOCc2c1
: