Target
C-X-C chemokine receptor type 2
Ligand
BDBM50297737
Substrate
Meas. Tech.
ChEMBL_584049 (CHEMBL1055929)
Ki
18±n/a nM
Citation
 Aki, CChao, JFerreira, JADwyer, MPYu, YChao, JMerritt, RJLai, GWu, MHipkin, RWFan, XGonsiorek, WFosseta, JRindgen, DFine, JLundell, DTaveras, AGBiju, P Diaminocyclobutenediones as potent and orally bioavailable CXCR2 receptor antagonists: SAR in the phenolic amide region. Bioorg Med Chem Lett 19:4446-9 (2009)  
Target
Name:
C-X-C chemokine receptor type 2
Synonyms:
C-X-C chemokine receptor type 2 (CXCR-2) CD_antigen=CD182 CXCR-2 CXCR2_HUMAN GRO/MGSA receptor IL-8 receptor type 2 IL8RB | Interleukin-8 receptor B
Type:
Protein
Mol. Mass.:
40767.88
Organism:
Homo sapiens (Human)
Description:
P25025
Residue:
360
  
Inhibitor
Name:
BDBM50297737
Synonyms:
(R)-3-(2-hydroxy-3-((S)-3-hydroxypyrrolidine-1-carbonyl)phenylamino)-4-(1-phenylpropylamino)cyclobut-3-ene-1,2-dione | CHEMBL556656
Type:
Small organic molecule
Emp. Form.:
C24H25N3O5
Mol. Mass.:
435.4724
SMILES:
CC[C@@H](Nc1c(Nc2cccc(C(=O)N3CC[C@H](O)C3)c2O)c(=O)c1=O)c1ccccc1
: