Target
TGF-beta receptor type-1
Ligand
BDBM50110208
Substrate
Meas. Tech.
ChEMBL_585583 (CHEMBL1062747)
IC50
94±n/a nM
Citation
 Li, XWang, LLong, LXiao, JHu, YLi, S Synthesis and biological evaluation of 1,2,4-trisubstituted imidazoles and 1,3,5-trisubstituted pyrazoles as inhibitors of transforming growth factor beta type 1 receptor (ALK5). Bioorg Med Chem Lett 19:4868-72 (2009)  
Target
Name:
TGF-beta receptor type-1
Synonyms:
ALK-5 Activin A receptor type II-like protein kinase of 53kD SKR4 TGF-beta receptor type I TGFBR1 TGFR1_HUMAN Transforming growth factor-beta receptor type I
Type:
enzyme
Mol. Mass.:
55968.24
Organism:
Homo sapiens (Human)
Description:
P36897
Residue:
503
  
Inhibitor
Name:
BDBM50110208
Synonyms:
4-(4-(benzo[d][1,3]dioxol-5-yl)-5-(pyridin-2-yl)-1H-imidazol-2-yl)benzamide 4-(5-(benzo[d][1,3]dioxol-5-yl)-4-(pyridin-2-yl)-1H-imidazol-2-yl)benzamide CHEMBL440084 cid_4521392
Type:
Small organic molecule
Emp. Form.:
C22H16N4O3
Mol. Mass.:
384.3874
SMILES:
NC(=O)c1ccc(cc1)-c1nc(c([nH]1)-c1ccc2OCOc2c1)-c1ccccn1
: