Target
Sterol O-acyltransferase 1
Ligand
BDBM50276483
Substrate
Meas. Tech.
ChEMBL_588465 (CHEMBL1040363)
IC50
35±n/a nM
Citation
 Asano, SBan, HKino, KIoriya, KMuraoka, M Synthesis and structure-activity relationships of N-(4-amino-2,6-diisopropylphenyl)-N'-(1,4-diarylpiperidine-4-yl)methylureas as anti-hyperlipidemic agents. Bioorg Med Chem 17:4636-46 (2009)  
Target
Name:
Sterol O-acyltransferase 1
Synonyms:
ACAT-1 Acat SOAT1_RAT Sterol O-acyltransferase, Soat
Type:
PROTEIN
Mol. Mass.:
64165.56
Organism:
Rattus norvegicus
Description:
ChEMBL_28796
Residue:
545
  
Inhibitor
Name:
BDBM50276483
Synonyms:
1-(2,6-diisopropylphenyl)-3-((4-(3-methoxyphenyl)-1-phenylpiperidin-4-yl)methyl)urea N-(2,6-Diisopropylphenyl)-N'-{[4-(3-methoxyphenyl)-1-phenylpiperidin-4-yl]methyl}urea
Type:
Small organic molecule
Emp. Form.:
C32H41N3O2
Mol. Mass.:
499.6868
SMILES:
COc1cccc(c1)C1(CNC(=O)Nc2c(cccc2C(C)C)C(C)C)CCN(CC1)c1ccccc1
: