Target
Sterol O-acyltransferase 1
Ligand
BDBM50276488
Substrate
Meas. Tech.
ChEMBL_588465 (CHEMBL1040363)
IC50
48±n/a nM
Citation
 Asano, SBan, HKino, KIoriya, KMuraoka, M Synthesis and structure-activity relationships of N-(4-amino-2,6-diisopropylphenyl)-N'-(1,4-diarylpiperidine-4-yl)methylureas as anti-hyperlipidemic agents. Bioorg Med Chem 17:4636-46 (2009)  
Target
Name:
Sterol O-acyltransferase 1
Synonyms:
ACAT-1 Acat SOAT1_RAT Sterol O-acyltransferase, Soat
Type:
PROTEIN
Mol. Mass.:
64165.56
Organism:
Rattus norvegicus
Description:
ChEMBL_28796
Residue:
545
  
Inhibitor
Name:
BDBM50276488
Synonyms:
1-(4-amino-2,6-diisopropylphenyl)-3-((1,4-bis(3-methoxyphenyl)piperidin-4-yl)methyl)urea dihydrochloride CHEMBL572410
Type:
Small organic molecule
Emp. Form.:
C33H44N4O3
Mol. Mass.:
544.7275
SMILES:
COc1cccc(c1)N1CCC(CNC(=O)Nc2c(cc(N)cc2C(C)C)C(C)C)(CC1)c1cccc(OC)c1
: