Target
RAC-alpha serine/threonine-protein kinase
Ligand
BDBM16938
Substrate
Meas. Tech.
ChEMBL_587680 (CHEMBL1049250)
IC50
1.5±n/a nM
Citation
 Dong, XJiang, CHu, HYan, JChen, JHu, Y QSAR study of Akt/protein kinase B (PKB) inhibitors using support vector machine. Eur J Med Chem 44:4090-7 (2009)  
Target
Name:
RAC-alpha serine/threonine-protein kinase
Synonyms:
AKT phosphorylation (p-AKT) AKT1/PPP1CA C-AKT PKB alpha Protein kinase B Protein kinase B (Akt 1) Protein kinase B alpha Proto-oncogene Akt (Akt1) Proto-oncogene c-Akt (AKT1) RAC-PK-alpha RAC-alpha serine/threonine-protein kinase (AKT1) | RAC-alpha serine/threonine-protein kinase (pAKT)
Type:
Enzyme
Mol. Mass.:
55681.25
Organism:
Homo sapiens (Human)
Description:
P31749
Residue:
480
  
Inhibitor
Name:
BDBM16938
Synonyms:
5-{5-[(2S)-2-amino-3-(1H-indol-3-yl)propoxy]pyridin-3-yl}-3,3-difluoro-2,3-dihydro-1H-indol-2-one | oxindole pyridine, 9t
Type:
Small organic molecule
Emp. Form.:
C24H20F2N4O2
Mol. Mass.:
434.438
SMILES:
N[C@H](COc1cncc(c1)-c1ccc2NC(=O)C(F)(F)c2c1)Cc1c[nH]c2ccccc12
: