Target
RAC-alpha serine/threonine-protein kinase
Ligand
BDBM16956
Substrate
Meas. Tech.
ChEMBL_587680 (CHEMBL1049250)
IC50
2±n/a nM
Citation
 Dong, XJiang, CHu, HYan, JChen, JHu, Y QSAR study of Akt/protein kinase B (PKB) inhibitors using support vector machine. Eur J Med Chem 44:4090-7 (2009)  
Target
Name:
RAC-alpha serine/threonine-protein kinase
Synonyms:
AKT phosphorylation (p-AKT) AKT1/PPP1CA C-AKT PKB alpha Protein kinase B Protein kinase B (Akt 1) Protein kinase B alpha Proto-oncogene Akt (Akt1) Proto-oncogene c-Akt (AKT1) RAC-PK-alpha RAC-alpha serine/threonine-protein kinase (AKT1) | RAC-alpha serine/threonine-protein kinase (pAKT)
Type:
Enzyme
Mol. Mass.:
55681.25
Organism:
Homo sapiens (Human)
Description:
P31749
Residue:
480
  
Inhibitor
Name:
BDBM16956
Synonyms:
6-{5-[(2S)-2-amino-3-(1H-indol-3-yl)propoxy]-2-ethenylpyridin-3-yl}isoquinoline | Isoquinoline-pyridine, 10c
Type:
Small organic molecule
Emp. Form.:
C27H24N4O
Mol. Mass.:
420.5057
SMILES:
N[C@H](COc1cnc(C=C)c(c1)-c1ccc2cnccc2c1)Cc1c[nH]c2ccccc12
: