Target
RAC-alpha serine/threonine-protein kinase
Ligand
BDBM50298463
Substrate
Meas. Tech.
ChEMBL_587680 (CHEMBL1049250)
IC50
9.8±n/a nM
Citation
 Dong, XJiang, CHu, HYan, JChen, JHu, Y QSAR study of Akt/protein kinase B (PKB) inhibitors using support vector machine. Eur J Med Chem 44:4090-7 (2009)  
Target
Name:
RAC-alpha serine/threonine-protein kinase
Synonyms:
AKT phosphorylation (p-AKT) AKT1/PPP1CA C-AKT PKB alpha Protein kinase B Protein kinase B (Akt 1) Protein kinase B alpha Proto-oncogene Akt (Akt1) Proto-oncogene c-Akt (AKT1) RAC-PK-alpha RAC-alpha serine/threonine-protein kinase (AKT1) | RAC-alpha serine/threonine-protein kinase (pAKT)
Type:
Enzyme
Mol. Mass.:
55681.25
Organism:
Homo sapiens (Human)
Description:
P31749
Residue:
480
  
Inhibitor
Name:
BDBM50298463
Synonyms:
(S)-1-(1H-indol-3-yl)-3-(5-(3-(thiazol-2-yl)-1H-indazol-5-yl)pyridin-3-yloxy)propan-2-amine | CHEMBL574995
Type:
Small organic molecule
Emp. Form.:
C26H22N6OS
Mol. Mass.:
466.557
SMILES:
N[C@H](COc1cncc(c1)-c1ccc2[nH]nc(-c3nccs3)c2c1)Cc1c[nH]c2ccccc12
: