Target
RAC-alpha serine/threonine-protein kinase
Ligand
BDBM50298472
Substrate
Meas. Tech.
ChEMBL_587680 (CHEMBL1049250)
IC50
6.8±n/a nM
Citation
 Dong, XJiang, CHu, HYan, JChen, JHu, Y QSAR study of Akt/protein kinase B (PKB) inhibitors using support vector machine. Eur J Med Chem 44:4090-7 (2009)  
Target
Name:
RAC-alpha serine/threonine-protein kinase
Synonyms:
AKT phosphorylation (p-AKT) AKT1/PPP1CA C-AKT PKB alpha Protein kinase B Protein kinase B (Akt 1) Protein kinase B alpha Proto-oncogene Akt (Akt1) Proto-oncogene c-Akt (AKT1) RAC-PK-alpha RAC-alpha serine/threonine-protein kinase (AKT1) | RAC-alpha serine/threonine-protein kinase (pAKT)
Type:
Enzyme
Mol. Mass.:
55681.25
Organism:
Homo sapiens (Human)
Description:
P31749
Residue:
480
  
Inhibitor
Name:
BDBM50298472
Synonyms:
(S)-1-(5-(3-methyl-1H-pyrazolo[3,4-c]pyridin-5-yl)pyridin-3-yloxy)-3-(3-(piperidin-4-ylmethoxy)phenyl)propan-2-amine | CHEMBL576372
Type:
Small organic molecule
Emp. Form.:
C27H32N6O2
Mol. Mass.:
472.582
SMILES:
Cc1n[nH]c2cnc(cc12)-c1cncc(OC[C@@H](N)Cc2cccc(OCC3CCNCC3)c2)c1
: