Target
Adenosine receptor A2a
Ligand
BDBM50108043
Substrate
Meas. Tech.
ChEMBL_587703 (CHEMBL1037717)
Ki
0.12±n/a nM
Citation
 Michielan, LBolcato, CFederico, SCacciari, BBacilieri, MKlotz, KNKachler, SPastorin, GCardin, RSperduti, ASpalluto, GMoro, S Combining selectivity and affinity predictions using an integrated Support Vector Machine (SVM) approach: An alternative tool to discriminate between the human adenosine A(2A) and A(3) receptor pyrazolo-triazolo-pyrimidine antagonists binding sites. Bioorg Med Chem 17:5259-74 (2009)  
Target
Name:
Adenosine receptor A2a
Synonyms:
A2A adenosine receptor (hA2A) ADENOSINE A2 ADORA2 Adenosine A2A receptor (A2AAR)
Type:
G Protein-Coupled Receptor (GPCR)
Mol. Mass.:
44716.46
Organism:
Homo sapiens (Human)
Description:
P29274
Residue:
412
  
Inhibitor
Name:
BDBM50108043
Synonyms:
2,2'-(4-(2-(5-amino-2-(furan-2-yl)-7H-pyrazolo[4,3-e][1,2,4]triazolo[1,5-c]pyrimidin-7-yl)ethyl)phenylazanediyl)diethanol CHEMBL22202
Type:
Small organic molecule
Emp. Form.:
C22H24N8O3
Mol. Mass.:
448.4778
SMILES:
Nc1nc2n(CCc3ccc(cc3)N(CCO)CCO)ncc2c2nc(nn12)-c1ccco1
: