Target
Adenosine receptor A3
Ligand
BDBM50109435
Substrate
Meas. Tech.
ChEMBL_587704 (CHEMBL1037718)
Ki
0.45±n/a nM
Citation
 Michielan, LBolcato, CFederico, SCacciari, BBacilieri, MKlotz, KNKachler, SPastorin, GCardin, RSperduti, ASpalluto, GMoro, S Combining selectivity and affinity predictions using an integrated Support Vector Machine (SVM) approach: An alternative tool to discriminate between the human adenosine A(2A) and A(3) receptor pyrazolo-triazolo-pyrimidine antagonists binding sites. Bioorg Med Chem 17:5259-74 (2009)  
Target
Name:
Adenosine receptor A3
Synonyms:
A3 adenosine receptor (hA3) ADORA3 | Adenosine A3 receptor (A3AR)
Type:
G Protein-Coupled Receptor (GPCR)
Mol. Mass.:
36197.32
Organism:
Homo sapiens (Human)
Description:
P0DMS8
Residue:
318
  
Inhibitor
Name:
BDBM50109435
Synonyms:
1-(4-Bromo-phenyl)-3-(2-furan-2-yl-8-propyl-8H-pyrazolo[4,3-e][1,2,4]triazolo[1,5-c]pyrimidin-5-yl)-urea CHEMBL350205
Type:
Small organic molecule
Emp. Form.:
C20H17BrN8O2
Mol. Mass.:
481.305
SMILES:
CCCn1cc2c(n1)nc(NC(=O)Nc1ccc(Br)cc1)n1nc(nc21)-c1ccco1
: