Target
Acyl-CoA desaturase 1
Ligand
BDBM50257967
Substrate
Meas. Tech.
ChEMBL_588105 (CHEMBL1044831)
IC50
0.6±n/a nM
Citation
 Koltun, DOZilbershtein, TMMigulin, VAVasilevich, NIParkhill, EQGlushkov, AIMcGregor, MJBrunn, SAChu, NHao, JMollova, NLeung, KChisholm, JWZablocki, J Potent, orally bioavailable, liver-selective stearoyl-CoA desaturase (SCD) inhibitors. Bioorg Med Chem Lett 19:4070-4 (2009)  
Target
Name:
Acyl-CoA desaturase 1
Synonyms:
ACOD1_RAT Scd Stearoyl-CoA desaturase 1 (SCD1)
Type:
Enzyme
Mol. Mass.:
41485.97
Organism:
Rattus norvegicus (Rat)
Description:
P07308
Residue:
358
  
Inhibitor
Name:
BDBM50257967
Synonyms:
CHEMBL494748 | N-(2-(7-(4-chloro-3-(trifluoromethyl)benzylamino)-3-(4-methoxyphenyl)-2-oxoquinoxalin-1(2H)-yl)ethyl)acetamide
Type:
Small organic molecule
Emp. Form.:
C27H24ClF3N4O3
Mol. Mass.:
544.953
SMILES:
COc1ccc(cc1)-c1nc2ccc(NCc3ccc(Cl)c(c3)C(F)(F)F)cc2n(CCNC(C)=O)c1=O
: