Target
Mu-type opioid receptor
Ligand
BDBM50040123
Substrate
Meas. Tech.
ChEMBL_590531 (CHEMBL1059346)
Ki
3.5±n/a nM
Citation
 Patkar, KAMurray, TFAldrich, JV The effects of C-terminal modifications on the opioid activity of [N-benzylTyr(1)]dynorphin A-(1-11) analogues. J Med Chem 52:6814-21 (2009)  
Target
Name:
Mu-type opioid receptor
Synonyms:
MOR-1 Mu-type opioid receptor (MOR) OPRM_RAT Opioid receptor B Ror-b
Type:
G Protein-Coupled Receptor (GPCR)
Mol. Mass.:
44503.11
Organism:
Rattus norvegicus (rat)
Description:
Competition binding assays were carried out using membrane preparations from transfected HN9.10 cells that constitutively expressed the mu opioid receptor.
Residue:
398
  
Inhibitor
Name:
BDBM50040123
Synonyms:
CHEMBL438223 Tyr-Gly-Gly-Phe-Leu-Arg-Arg-Ile-Arg-Pro-Lys | [D-Pro-10]Dyn A-(1-11)
Type:
Small organic molecule
Emp. Form.:
C63H103N21O13
Mol. Mass.:
1362.6248
SMILES:
CC[C@H](C)[C@H](NC(=O)[C@H](CCCNC(N)=N)NC(=O)[C@H](CCCNC(N)=N)NC(=O)[C@H](CC(C)C)NC(=O)[C@H](Cc1ccccc1)NC(=O)CNC(=O)CNC(=O)[C@@H](N)Cc1ccc(O)cc1)C(=O)N[C@@H](CCCNC(N)=N)C(=O)N1CCC[C@H]1C(=O)N[C@@H](CCCCN)C(O)=O
: