Target
Substance-P receptor
Ligand
BDBM50299469
Substrate
Meas. Tech.
ChEMBL_590799 (CHEMBL1037637)
Ki
151.8±n/a nM
Citation
 Malherbe, PKratzeisen, CMarcuz, AZenner, MTNettekoven, MHRatni, HWettstein, JGBissantz, C Identification of a critical residue in the transmembrane domain 2 of tachykinin neurokinin 3 receptor affecting the dissociation kinetics and antagonism mode of osanetant (SR 142801) and piperidine-based structures. J Med Chem 52:7103-12 (2009)  
Target
Name:
Substance-P receptor
Synonyms:
NK-1 receptor NK1 Receptor NK1R_HUMAN Neurokinin-1 (NK-1) SPR TACR1 Tachykinin receptor 1 (NK1) | tachykinin
Type:
G Protein-Coupled Receptor (GPCR)
Mol. Mass.:
46254.43
Organism:
Homo sapiens (Human)
Description:
P25103
Residue:
407
  
Inhibitor
Name:
BDBM50299469
Synonyms:
4-[4-(acetylmethyl-amino)-piperidin-1-yl]-2-(3,4-dichlorophenyl)-N-(4-fluoro-3-trifluoromethylbenzyl)-2,N-dimethylbutyramide | CHEMBL567849
Type:
Small organic molecule
Emp. Form.:
C28H33Cl2F4N3O2
Mol. Mass.:
590.48
SMILES:
CN(Cc1ccc(F)c(c1)C(F)(F)F)C(=O)C(C)(CCN1CCC(CC1)N(C)C(C)=O)c1ccc(Cl)c(Cl)c1
: