Target
Alkaline phosphatase, tissue-nonspecific isozyme
Ligand
BDBM50299523
Substrate
Meas. Tech.
ChEMBL_591448 (CHEMBL1054568)
IC50
270±n/a nM
Citation
 Dahl, RSergienko, EASu, YMostofi, YSYang, LSimao, AMNarisawa, SBrown, BMangravita-Novo, AVicchiarelli, MSmith, LHO'Neill, WCMillán, JLCosford, ND Discovery and validation of a series of aryl sulfonamides as selective inhibitors of tissue-nonspecific alkaline phosphatase (TNAP). J Med Chem 52:6919-25 (2009)  
Target
Name:
Alkaline phosphatase, tissue-nonspecific isozyme
Synonyms:
ALPL tissue-nonspecific alkaline phosphatase precursor
Type:
PROTEIN
Mol. Mass.:
57306.17
Organism:
Homo sapiens (Human)
Description:
ChEMBL_1448917
Residue:
524
  
Inhibitor
Name:
BDBM50299523
Synonyms:
2,5-Dimethoxy-N-(quinolin-3-yl)benzenesulfonamide cid_2931238
Type:
Small organic molecule
Emp. Form.:
C17H16N2O4S
Mol. Mass.:
344.385
SMILES:
COc1ccc(OC)c(c1)S(=O)(=O)Nc1cnc2ccccc2c1
: