Target
Rho-associated protein kinase 1
Ligand
BDBM50299584
Substrate
Meas. Tech.
ChEMBL_592395 (CHEMBL1036968)
IC50
310±n/a nM
Citation
 Harrison, BAWhitlock, NAVoronkov, MVAlmstead, ZYGu, KJMabon, RGardyan, MHamman, BDAllen, JGopinathan, SMcKnight, BCrist, MZhang, YLiu, YCourtney, LFKey, BZhou, JPatel, NYates, PWLiu, QWilson, AGKimball, SDCrosson, CERice, DSRawlins, DB Novel class of LIM-kinase 2 inhibitors for the treatment of ocular hypertension and associated glaucoma. J Med Chem 52:6515-8 (2009)  
Target
Name:
Rho-associated protein kinase 1
Synonyms:
ROCK-I ROCK1_HUMAN Rho-associated protein kinase Rho-associated, coiled-coil-containing protein kinase 1 Rho-kinase (ROCK I) p160 ROCK-1 | p160ROCK
Type:
Serine/threonine-protein kinase
Mol. Mass.:
158156.77
Organism:
Homo sapiens (Human)
Description:
Q13464
Residue:
1354
  
Inhibitor
Name:
BDBM50299584
Synonyms:
(S)-N-(3-bromo-4-fluorophenyl)-N'-cyano-2-methyl-4-(5-methyl-7H-pyrrolo[2,3-d]pyrimidin-4-yl)piperazine-1-carboximidamide | CHEMBL565452
Type:
Small organic molecule
Emp. Form.:
C20H20BrFN8
Mol. Mass.:
471.329
SMILES:
C[C@H]1CN(CCN1C(NC#N)=Nc1ccc(F)c(Br)c1)c1ncnc2[nH]cc(C)c12
: