Target
LIM domain kinase 2
Ligand
BDBM50299597
Substrate
Meas. Tech.
ChEMBL_592392 (CHEMBL1036965)
IC50
38±n/a nM
Citation
 Harrison, BAWhitlock, NAVoronkov, MVAlmstead, ZYGu, KJMabon, RGardyan, MHamman, BDAllen, JGopinathan, SMcKnight, BCrist, MZhang, YLiu, YCourtney, LFKey, BZhou, JPatel, NYates, PWLiu, QWilson, AGKimball, SDCrosson, CERice, DSRawlins, DB Novel class of LIM-kinase 2 inhibitors for the treatment of ocular hypertension and associated glaucoma. J Med Chem 52:6515-8 (2009)  
Target
Name:
LIM domain kinase 2
Synonyms:
LIMK2 | LIMK2_HUMAN
Type:
PROTEIN
Mol. Mass.:
72238.81
Organism:
Homo sapiens (Human)
Description:
ChEMBL_1514398
Residue:
638
  
Inhibitor
Name:
BDBM50299597
Synonyms:
CHEMBL571280 | N-(3-bromophenyl)-4-(5-methyl-7H-pyrrolo[2,3-d]pyrimidin-4-yl)piperazine-1-carboxamide
Type:
Small organic molecule
Emp. Form.:
C18H19BrN6O
Mol. Mass.:
415.287
SMILES:
Cc1c[nH]c2ncnc(N3CCN(CC3)C(=O)Nc3cccc(Br)c3)c12
: