Target
LIM domain kinase 2
Ligand
BDBM50299606
Substrate
Meas. Tech.
ChEMBL_592392 (CHEMBL1036965)
IC50
8.1±n/a nM
Citation
 Harrison, BAWhitlock, NAVoronkov, MVAlmstead, ZYGu, KJMabon, RGardyan, MHamman, BDAllen, JGopinathan, SMcKnight, BCrist, MZhang, YLiu, YCourtney, LFKey, BZhou, JPatel, NYates, PWLiu, QWilson, AGKimball, SDCrosson, CERice, DSRawlins, DB Novel class of LIM-kinase 2 inhibitors for the treatment of ocular hypertension and associated glaucoma. J Med Chem 52:6515-8 (2009)  
Target
Name:
LIM domain kinase 2
Synonyms:
LIMK2 | LIMK2_HUMAN
Type:
PROTEIN
Mol. Mass.:
72238.81
Organism:
Homo sapiens (Human)
Description:
ChEMBL_1514398
Residue:
638
  
Inhibitor
Name:
BDBM50299606
Synonyms:
(+/-)-N-(3-bromophenyl)-N'-cyano-2-methyl-4-(7H-pyrrolo[2,3-d]pyrimidin-4-yl)piperazine-1-carboximidamide | CHEMBL572371
Type:
Small organic molecule
Emp. Form.:
C19H19BrN8
Mol. Mass.:
439.312
SMILES:
CC1CN(CCN1C(NC#N)=Nc1cccc(Br)c1)c1ncnc2[nH]ccc12
: