Target
LIM domain kinase 2
Ligand
BDBM50299607
Substrate
Meas. Tech.
ChEMBL_592392 (CHEMBL1036965)
IC50
1.2±n/a nM
Citation
 Harrison, BAWhitlock, NAVoronkov, MVAlmstead, ZYGu, KJMabon, RGardyan, MHamman, BDAllen, JGopinathan, SMcKnight, BCrist, MZhang, YLiu, YCourtney, LFKey, BZhou, JPatel, NYates, PWLiu, QWilson, AGKimball, SDCrosson, CERice, DSRawlins, DB Novel class of LIM-kinase 2 inhibitors for the treatment of ocular hypertension and associated glaucoma. J Med Chem 52:6515-8 (2009)  
Target
Name:
LIM domain kinase 2
Synonyms:
LIMK2 | LIMK2_HUMAN
Type:
PROTEIN
Mol. Mass.:
72238.81
Organism:
Homo sapiens (Human)
Description:
ChEMBL_1514398
Residue:
638
  
Inhibitor
Name:
BDBM50299607
Synonyms:
(S)-N-(3-bromophenyl)-4-(5-chloro-7H-pyrrolo[2,3-d]pyrimidin-4-yl)-N'-cyano-2-methylpiperazine-1-carboximidamide | CHEMBL577194
Type:
Small organic molecule
Emp. Form.:
C19H18BrClN8
Mol. Mass.:
473.757
SMILES:
C[C@H]1CN(CCN1C(NC#N)=Nc1cccc(Br)c1)c1ncnc2[nH]cc(Cl)c12
: