Target
Cyclin-dependent kinase 5 activator 1
Ligand
BDBM50414912
Substrate
Meas. Tech.
ChEMBL_590314 (CHEMBL1054437)
IC50
4.1±n/a nM
Citation
 Kaller, MRZhong, WHenley, CMagal, ENguyen, TPowers, DRzasa, RMWang, WXiong, XNorman, MH Design and synthesis of 6-oxo-1,6-dihydropyridines as CDK5 inhibitors. Bioorg Med Chem Lett 19:6591-4 (2009)  
Target
Name:
Cyclin-dependent kinase 5 activator 1
Synonyms:
CDK5/p35 Cyclin-dependent kinase 5 regulatory subunit 1 | Cyclin-dependent kinase 5/CDK5 activator 1
Type:
Protein Complex
Mol. Mass.:
Description:
Components:
This complex has 2 components.
Component 1
Name:
Cyclin-dependent kinase 5
Synonyms:
CDK5 CDKN5 Cyclin-dependent kinase 5 (CDK5/ p25) Cyclin-dependent-like kinase 5 PSSALRE Tau protein kinase II catalytic subunit
Type:
Enzyme Subunit
Mol. Mass.:
33308.61
Organism:
Homo sapiens (Human)
Description:
Residue:
292
  
Component 2
Name:
Cyclin-dependent kinase 5 activator 1
Synonyms:
CD5R1_HUMAN CDK5R1 Cyclin-dependent kinase 5 (CDK5/p25) NCK5A p35
Type:
Enzyme Subunit
Mol. Mass.:
34077.43
Organism:
Homo sapiens (Human)
Description:
Q15078
Residue:
307
  
Inhibitor
Name:
BDBM50414912
Synonyms:
CHEMBL566532
Type:
Small organic molecule
Emp. Form.:
C18H17N3O3S
Mol. Mass.:
355.411
SMILES:
CCOC(=O)c1cc(-c2csc(n2)-c2ccncc2)c(=O)[nH]c1CC
: