Target
Histone-lysine N-methyltransferase EHMT2
Ligand
BDBM50300035
Substrate
Meas. Tech.
ChEMBL_593233 (CHEMBL1046740)
IC50
>10000±n/a nM
Citation
 Liu, FChen, XAllali-Hassani, AQuinn, AMWasney, GADong, ABarsyte, DKozieradzki, ISenisterra, GChau, ISiarheyeva, AKireev, DBJadhav, AHerold, JMFrye, SVArrowsmith, CHBrown, PJSimeonov, AVedadi, MJin, J Discovery of a 2,4-diamino-7-aminoalkoxyquinazoline as a potent and selective inhibitor of histone lysine methyltransferase G9a. J Med Chem 52:7950-3 (2009)  
Target
Name:
Histone-lysine N-methyltransferase EHMT2
Synonyms:
BAT8 EHMT2 G9A Histone-lysine N-methyltransferase EHMT1/EHMT2 KMT1C Protein G9a (G9a)
Type:
Enzyme
Mol. Mass.:
132339.87
Organism:
Homo sapiens (Human)
Description:
Q96KQ7
Residue:
1210
  
Inhibitor
Name:
BDBM50300035
Synonyms:
6,7-Dimethoxy-2-(4-methyl-1,4-diazepan-1-yl)-N-(piperidin-4-yl)quinazolin-4-amine | CHEMBL570119
Type:
Small organic molecule
Emp. Form.:
C21H32N6O2
Mol. Mass.:
400.5178
SMILES:
COc1cc2nc(nc(NC3CCNCC3)c2cc1OC)N1CCCN(C)CC1
: