Target
Beta-secretase 1
Ligand
BDBM114543
Substrate
Meas. Tech.
ChEMBL_592911 (CHEMBL1048414)
Kd
15000±n/a nM
Citation
 Zhu, ZSun, ZYYe, YVoigt, JStrickland, CSmith, EMCumming, JWang, LWong, JWang, YSWyss, DFChen, XKuvelkar, RKennedy, MEFavreau, LParker, EMcKittrick, BAStamford, ACzarniecki, MGreenlee, WHunter, JC Discovery of cyclic acylguanidines as highly potent and selective beta-site amyloid cleaving enzyme (BACE) inhibitors: Part I--inhibitor design and validation. J Med Chem 53:951-65 (2010)  
Target
Name:
Beta-secretase 1
Synonyms:
ASP2 Aspartyl protease 2 BACE1 Beta-secretase (BACE) Beta-secretase 1 (BACE 1) Beta-secretase 1 (BACE1) Beta-site amyloid precursor protein cleaving enzyme 1 Memapsin-2 beta-Secretase (BACE-1) | beta-Secretase (BACE1)
Type:
Protein
Mol. Mass.:
55755.10
Organism:
Homo sapiens (Human)
Description:
P56817
Residue:
501
  
Inhibitor
Name:
BDBM114543
Synonyms:
(4-butoxy-3-chloranyl-phenyl)methyl carbamimidothioate;hydrochloride 2-(4-Butoxy-3-chloro-benzyl)-isothiourea CHEMBL568966 SMR000427725 cid_16681813
Type:
Small organic molecule
Emp. Form.:
C12H17ClN2OS
Mol. Mass.:
272.794
SMILES:
CCCCOc1ccc(CSC(N)=N)cc1Cl
: