Target
Beta-secretase 1
Ligand
BDBM50300226
Substrate
Meas. Tech.
ChEMBL_592911 (CHEMBL1048414)
Kd
123000±n/a nM
Citation
 Zhu, ZSun, ZYYe, YVoigt, JStrickland, CSmith, EMCumming, JWang, LWong, JWang, YSWyss, DFChen, XKuvelkar, RKennedy, MEFavreau, LParker, EMcKittrick, BAStamford, ACzarniecki, MGreenlee, WHunter, JC Discovery of cyclic acylguanidines as highly potent and selective beta-site amyloid cleaving enzyme (BACE) inhibitors: Part I--inhibitor design and validation. J Med Chem 53:951-65 (2010)  
Target
Name:
Beta-secretase 1
Synonyms:
ASP2 Aspartyl protease 2 BACE1 Beta-secretase (BACE) Beta-secretase 1 (BACE 1) Beta-secretase 1 (BACE1) Beta-site amyloid precursor protein cleaving enzyme 1 Memapsin-2 beta-Secretase (BACE-1) | beta-Secretase (BACE1)
Type:
Protein
Mol. Mass.:
55755.10
Organism:
Homo sapiens (Human)
Description:
P56817
Residue:
501
  
Inhibitor
Name:
BDBM50300226
Synonyms:
3-(3-Chlorobenzyl)-5-isobutyl-5-methyl-2-iminohydantoin | CHEMBL566306
Type:
Small organic molecule
Emp. Form.:
C15H20ClN3O
Mol. Mass.:
293.792
SMILES:
CC(C)CC1(C)N=C(N)N(Cc2cccc(Cl)c2)C1=O
: