Target
Adenosine receptor A3
Ligand
BDBM50300272
Substrate
Meas. Tech.
ChEMBL_590638 (CHEMBL1052922)
Ki
120±n/a nM
Citation
 Tosh, DKChinn, MIvanov, AAKlutz, AMGao, ZGJacobson, KA Functionalized congeners of A3 adenosine receptor-selective nucleosides containing a bicyclo[3.1.0]hexane ring system. J Med Chem 52:7580-92 (2009)  
Target
Name:
Adenosine receptor A3
Synonyms:
A3 adenosine receptor (hA3) ADORA3 | Adenosine A3 receptor (A3AR)
Type:
G Protein-Coupled Receptor (GPCR)
Mol. Mass.:
36197.32
Organism:
Homo sapiens (Human)
Description:
P0DMS8
Residue:
318
  
Inhibitor
Name:
BDBM50300272
Synonyms:
(1R,2R,3S,4R,5S)-4-(2-chloro-6-(cyclopentylamino)-9H-purin-9-yl)bicyclo[3.1.0]hexane-2,3-diol | CHEMBL576395
Type:
Small organic molecule
Emp. Form.:
C16H20ClN5O2
Mol. Mass.:
349.815
SMILES:
O[C@@H]1[C@@H]2C[C@@H]2[C@H]([C@@H]1O)n1cnc2c(NC3CCCC3)nc(Cl)nc12
: