Target
Adenosine receptor A2a
Ligand
BDBM50264213
Substrate
Meas. Tech.
ChEMBL_590636 (CHEMBL1052240)
Ki
1080±n/a nM
Citation
 Tosh, DKChinn, MIvanov, AAKlutz, AMGao, ZGJacobson, KA Functionalized congeners of A3 adenosine receptor-selective nucleosides containing a bicyclo[3.1.0]hexane ring system. J Med Chem 52:7580-92 (2009)  
Target
Name:
Adenosine receptor A2a
Synonyms:
A2A adenosine receptor (hA2A) ADENOSINE A2 ADORA2 Adenosine A2A receptor (A2AAR)
Type:
G Protein-Coupled Receptor (GPCR)
Mol. Mass.:
44716.46
Organism:
Homo sapiens (Human)
Description:
P29274
Residue:
412
  
Inhibitor
Name:
BDBM50264213
Synonyms:
(1'R,2'R,3'S,4'R,5'S)-4'-[2-Chloro-6-(3-iodobenzylamino)-purine]-2',3'-O-dihydroxybicyclo-[3.1.0]hexane CHEMBL490605
Type:
Small organic molecule
Emp. Form.:
C18H17ClIN5O2
Mol. Mass.:
497.717
SMILES:
O[C@@H]1[C@@H]2C[C@@H]2[C@H]([C@@H]1O)n1cnc2c(NCc3cccc(I)c3)nc(Cl)nc12
: