Target
Adenosine receptor A1
Ligand
BDBM50264213
Substrate
Meas. Tech.
ChEMBL_590633 (CHEMBL1052237)
Ki
3040±n/a nM
Citation
 Tosh, DKChinn, MIvanov, AAKlutz, AMGao, ZGJacobson, KA Functionalized congeners of A3 adenosine receptor-selective nucleosides containing a bicyclo[3.1.0]hexane ring system. J Med Chem 52:7580-92 (2009)  
Target
Name:
Adenosine receptor A1
Synonyms:
A1 adenosine receptor (hA1) AA1R_HUMAN ADORA1 Adenosine A1-receptor Adenosine receptor A1 (hA1) | Adenosine transporter (AdT)
Type:
G Protein-Coupled Receptor (GPCR)
Mol. Mass.:
36520.92
Organism:
Homo sapiens (Human)
Description:
P30542
Residue:
326
  
Inhibitor
Name:
BDBM50264213
Synonyms:
(1'R,2'R,3'S,4'R,5'S)-4'-[2-Chloro-6-(3-iodobenzylamino)-purine]-2',3'-O-dihydroxybicyclo-[3.1.0]hexane CHEMBL490605
Type:
Small organic molecule
Emp. Form.:
C18H17ClIN5O2
Mol. Mass.:
497.717
SMILES:
O[C@@H]1[C@@H]2C[C@@H]2[C@H]([C@@H]1O)n1cnc2c(NCc3cccc(I)c3)nc(Cl)nc12
: