Target
Adenosine receptor A3
Ligand
BDBM50300275
Substrate
Meas. Tech.
ChEMBL_590642 (CHEMBL1053708)
Ki
20.3±n/a nM
Citation
 Tosh, DKChinn, MIvanov, AAKlutz, AMGao, ZGJacobson, KA Functionalized congeners of A3 adenosine receptor-selective nucleosides containing a bicyclo[3.1.0]hexane ring system. J Med Chem 52:7580-92 (2009)  
Target
Name:
Adenosine receptor A3
Synonyms:
AA3R_RAT Adenosine receptor A2a and A3 | Adora3
Type:
PROTEIN
Mol. Mass.:
36643.73
Organism:
Rattus norvegicus
Description:
ChEMBL_479910
Residue:
320
  
Inhibitor
Name:
BDBM50300275
Synonyms:
(1R,2R,3S,4R,5S)-4-(6-(3-chlorobenzylamino)-9H-purin-9-yl)bicyclo[3.1.0]hexane-2,3-diol | CHEMBL583862
Type:
Small organic molecule
Emp. Form.:
C18H18ClN5O2
Mol. Mass.:
371.821
SMILES:
O[C@@H]1[C@@H]2C[C@@H]2[C@H]([C@@H]1O)n1cnc2c(NCc3cccc(Cl)c3)ncnc12
: