Target
Adenosine receptor A1
Ligand
BDBM50300289
Substrate
Meas. Tech.
ChEMBL_590633 (CHEMBL1052237)
Ki
260±n/a nM
Citation
 Tosh, DKChinn, MIvanov, AAKlutz, AMGao, ZGJacobson, KA Functionalized congeners of A3 adenosine receptor-selective nucleosides containing a bicyclo[3.1.0]hexane ring system. J Med Chem 52:7580-92 (2009)  
Target
Name:
Adenosine receptor A1
Synonyms:
A1 adenosine receptor (hA1) AA1R_HUMAN ADORA1 Adenosine A1-receptor Adenosine receptor A1 (hA1) | Adenosine transporter (AdT)
Type:
G Protein-Coupled Receptor (GPCR)
Mol. Mass.:
36520.92
Organism:
Homo sapiens (Human)
Description:
P30542
Residue:
326
  
Inhibitor
Name:
BDBM50300289
Synonyms:
(1R,2R,3S,4R,5S)-4-(2-chloro-6-(3-chlorobenzylamino)-9H-purin-9-yl)-2,3-dihydroxy-N-methylbicyclo[3.1.0]hexane-1-carboxamide | CHEMBL567226
Type:
Small organic molecule
Emp. Form.:
C20H20Cl2N6O3
Mol. Mass.:
463.317
SMILES:
CNC(=O)[C@]12C[C@@H]1[C@H]([C@H](O)[C@@H]2O)n1cnc2c(NCc3cccc(Cl)c3)nc(Cl)nc12
: