Target
Adenosine receptor A3
Ligand
BDBM50300291
Substrate
Meas. Tech.
ChEMBL_590638 (CHEMBL1052922)
Ki
61.1±n/a nM
Citation
 Tosh, DKChinn, MIvanov, AAKlutz, AMGao, ZGJacobson, KA Functionalized congeners of A3 adenosine receptor-selective nucleosides containing a bicyclo[3.1.0]hexane ring system. J Med Chem 52:7580-92 (2009)  
Target
Name:
Adenosine receptor A3
Synonyms:
A3 adenosine receptor (hA3) ADORA3 | Adenosine A3 receptor (A3AR)
Type:
G Protein-Coupled Receptor (GPCR)
Mol. Mass.:
36197.32
Organism:
Homo sapiens (Human)
Description:
P0DMS8
Residue:
318
  
Inhibitor
Name:
BDBM50300291
Synonyms:
(1'S,2'R,3'S,4'S,5'S)-4'-[6-(3-Chlorobenzylamino)-2-(4-hydroxycarbonyl)-1-butynyl)-9-yl]-20,30-dihydroxybicyclo[3.1.0]hexane-1'-carboxylic AcidN-Methylamide | CHEMBL573713
Type:
Small organic molecule
Emp. Form.:
C25H25ClN6O5
Mol. Mass.:
524.956
SMILES:
CNC(=O)[C@]12C[C@@H]1[C@H]([C@H](O)[C@@H]2O)n1cnc2c(NCc3cccc(Cl)c3)nc(nc12)C#CCCC(O)=O
: