Target
Histone deacetylase 7
Ligand
BDBM50300444
Substrate
Meas. Tech.
ChEMBL_592001 (CHEMBL1050116)
IC50
1760±n/a nM
Citation
 Tessier, PSmil, DVWahhab, ALeit, SRahil, JLi, ZDéziel, RBesterman, JM Diphenylmethylene hydroxamic acids as selective class IIa histone deacetylase inhibitors. Bioorg Med Chem Lett 19:5684-8 (2009)  
Target
Name:
Histone deacetylase 7
Synonyms:
HD7 HDAC7A Histone acetylase 7 (HDAC7) Human HDAC7
Type:
Chromatin regulator; hydrolase; repressor
Mol. Mass.:
102942.62
Organism:
Homo sapiens (Human)
Description:
Q8WUI4
Residue:
952
  
Inhibitor
Name:
BDBM50300444
Synonyms:
2,2-bis(4-fluorophenyl)-N-hydroxyacetamide | CHEMBL573190
Type:
Small organic molecule
Emp. Form.:
C14H11F2NO2
Mol. Mass.:
263.2394
SMILES:
ONC(=O)C(c1ccc(F)cc1)c1ccc(F)cc1
: