Target
Histone deacetylase 7
Ligand
BDBM50300448
Substrate
Meas. Tech.
ChEMBL_592001 (CHEMBL1050116)
IC50
4800±n/a nM
Citation
 Tessier, PSmil, DVWahhab, ALeit, SRahil, JLi, ZDéziel, RBesterman, JM Diphenylmethylene hydroxamic acids as selective class IIa histone deacetylase inhibitors. Bioorg Med Chem Lett 19:5684-8 (2009)  
Target
Name:
Histone deacetylase 7
Synonyms:
HD7 HDAC7A Histone acetylase 7 (HDAC7) Human HDAC7
Type:
Chromatin regulator; hydrolase; repressor
Mol. Mass.:
102942.62
Organism:
Homo sapiens (Human)
Description:
Q8WUI4
Residue:
952
  
Inhibitor
Name:
BDBM50300448
Synonyms:
CHEMBL585365 | N-hydroxy-2,2-diphenylpropanamide
Type:
Small organic molecule
Emp. Form.:
C15H15NO2
Mol. Mass.:
241.2851
SMILES:
CC(C(=O)NO)(c1ccccc1)c1ccccc1
: