Target
Histone deacetylase 4
Ligand
BDBM50300454
Substrate
Meas. Tech.
ChEMBL_591999 (CHEMBL1050114)
IC50
>10000±n/a nM
Citation
 Tessier, PSmil, DVWahhab, ALeit, SRahil, JLi, ZDéziel, RBesterman, JM Diphenylmethylene hydroxamic acids as selective class IIa histone deacetylase inhibitors. Bioorg Med Chem Lett 19:5684-8 (2009)  
Target
Name:
Histone deacetylase 4
Synonyms:
Cereblon/Histone deacetylase 4 HDAC4 Histone acetylase 4(HDAC4) KIAA0288
Type:
Enzyme
Mol. Mass.:
119049.39
Organism:
Homo sapiens (Human)
Description:
P56524
Residue:
1084
  
Inhibitor
Name:
BDBM50300454
Synonyms:
CHEMBL574378 | N-hydroxy-2,2-bis(4-(methylsulfonamido)phenyl)acetamide
Type:
Small organic molecule
Emp. Form.:
C16H19N3O6S2
Mol. Mass.:
413.469
SMILES:
CS(=O)(=O)Nc1ccc(cc1)C(C(=O)NO)c1ccc(NS(C)(=O)=O)cc1
: