Target
Histone deacetylase 4
Ligand
BDBM50300444
Substrate
Meas. Tech.
ChEMBL_591999 (CHEMBL1050114)
IC50
1100±n/a nM
Citation
 Tessier, PSmil, DVWahhab, ALeit, SRahil, JLi, ZDéziel, RBesterman, JM Diphenylmethylene hydroxamic acids as selective class IIa histone deacetylase inhibitors. Bioorg Med Chem Lett 19:5684-8 (2009)  
Target
Name:
Histone deacetylase 4
Synonyms:
Cereblon/Histone deacetylase 4 HDAC4 Histone acetylase 4(HDAC4) KIAA0288
Type:
Enzyme
Mol. Mass.:
119049.39
Organism:
Homo sapiens (Human)
Description:
P56524
Residue:
1084
  
Inhibitor
Name:
BDBM50300444
Synonyms:
2,2-bis(4-fluorophenyl)-N-hydroxyacetamide | CHEMBL573190
Type:
Small organic molecule
Emp. Form.:
C14H11F2NO2
Mol. Mass.:
263.2394
SMILES:
ONC(=O)C(c1ccc(F)cc1)c1ccc(F)cc1
: