Target
Histone deacetylase 4
Ligand
BDBM50300449
Substrate
Meas. Tech.
ChEMBL_591999 (CHEMBL1050114)
IC50
>10000±n/a nM
Citation
 Tessier, PSmil, DVWahhab, ALeit, SRahil, JLi, ZDéziel, RBesterman, JM Diphenylmethylene hydroxamic acids as selective class IIa histone deacetylase inhibitors. Bioorg Med Chem Lett 19:5684-8 (2009)  
Target
Name:
Histone deacetylase 4
Synonyms:
Cereblon/Histone deacetylase 4 HDAC4 Histone acetylase 4(HDAC4) KIAA0288
Type:
Enzyme
Mol. Mass.:
119049.39
Organism:
Homo sapiens (Human)
Description:
P56524
Residue:
1084
  
Inhibitor
Name:
BDBM50300449
Synonyms:
CHEMBL575259 | N-hydroxy-3,3-diphenylpropanamide
Type:
Small organic molecule
Emp. Form.:
C15H15NO2
Mol. Mass.:
241.2851
SMILES:
ONC(=O)CC(c1ccccc1)c1ccccc1
: