Target
Histone deacetylase 7
Ligand
BDBM50300453
Substrate
Meas. Tech.
ChEMBL_592001 (CHEMBL1050116)
IC50
110±n/a nM
Citation
 Tessier, PSmil, DVWahhab, ALeit, SRahil, JLi, ZDéziel, RBesterman, JM Diphenylmethylene hydroxamic acids as selective class IIa histone deacetylase inhibitors. Bioorg Med Chem Lett 19:5684-8 (2009)  
Target
Name:
Histone deacetylase 7
Synonyms:
HD7 HDAC7A Histone acetylase 7 (HDAC7) Human HDAC7
Type:
Chromatin regulator; hydrolase; repressor
Mol. Mass.:
102942.62
Organism:
Homo sapiens (Human)
Description:
Q8WUI4
Residue:
952
  
Inhibitor
Name:
BDBM50300453
Synonyms:
2,2-bis(2,3-dihydrobenzofuran-5-yl)-N-hydroxyacetamide | CHEMBL583967
Type:
Small organic molecule
Emp. Form.:
C18H17NO4
Mol. Mass.:
311.3319
SMILES:
ONC(=O)C(c1ccc2OCCc2c1)c1ccc2OCCc2c1
: