Target
Procathepsin L
Ligand
BDBM50300781
Substrate
Meas. Tech.
ChEMBL_591546 (CHEMBL1062952)
IC50
700±n/a nM
Citation
 Mallari, JPShelat, AAKosinski, ACaffrey, CRConnelly, MZhu, FMcKerrow, JHGuy, RK Structure-guided development of selective TbcatB inhibitors. J Med Chem 52:6489-93 (2009)  
Target
Name:
Procathepsin L
Synonyms:
CATL1_HUMAN CTSL CTSL1 Cathepsin L Cathepsin L1 heavy chain MEP cathepsin L preproprotein
Type:
Enzyme
Mol. Mass.:
37557.19
Organism:
Homo sapiens (Human)
Description:
Purchased from Calbiochem (San Diego, CA).
Residue:
333
  
Inhibitor
Name:
BDBM50300781
Synonyms:
6-((3'-chlorobiphenyl-3-yl)methylamino)-9-(3-hydroxypropyl)-9H-purine-2-carbonitrile | CHEMBL566094
Type:
Small organic molecule
Emp. Form.:
C22H19ClN6O
Mol. Mass.:
418.879
SMILES:
OCCCn1cnc2c(NCc3cccc(c3)-c3cccc(Cl)c3)nc(nc12)C#N
: