Target
Procathepsin L
Ligand
BDBM50300784
Substrate
Meas. Tech.
ChEMBL_591546 (CHEMBL1062952)
IC50
1000±n/a nM
Citation
 Mallari, JPShelat, AAKosinski, ACaffrey, CRConnelly, MZhu, FMcKerrow, JHGuy, RK Structure-guided development of selective TbcatB inhibitors. J Med Chem 52:6489-93 (2009)  
Target
Name:
Procathepsin L
Synonyms:
CATL1_HUMAN CTSL CTSL1 Cathepsin L Cathepsin L1 heavy chain MEP cathepsin L preproprotein
Type:
Enzyme
Mol. Mass.:
37557.19
Organism:
Homo sapiens (Human)
Description:
Purchased from Calbiochem (San Diego, CA).
Residue:
333
  
Inhibitor
Name:
BDBM50300784
Synonyms:
9-(3-hydroxypropyl)-6-(3-(1-(phenylsulfonyl)-1H-indol-3-yl)benzylamino)-9H-purine-2-carbonitrile | CHEMBL582971
Type:
Small organic molecule
Emp. Form.:
C30H25N7O3S
Mol. Mass.:
563.63
SMILES:
OCCCn1cnc2c(NCc3cccc(c3)-c3cn(c4ccccc34)S(=O)(=O)c3ccccc3)nc(nc12)C#N
: