Target
Procathepsin L
Ligand
BDBM50268444
Substrate
Meas. Tech.
ChEMBL_591546 (CHEMBL1062952)
IC50
1400±n/a nM
Citation
 Mallari, JPShelat, AAKosinski, ACaffrey, CRConnelly, MZhu, FMcKerrow, JHGuy, RK Structure-guided development of selective TbcatB inhibitors. J Med Chem 52:6489-93 (2009)  
Target
Name:
Procathepsin L
Synonyms:
CATL1_HUMAN CTSL CTSL1 Cathepsin L Cathepsin L1 heavy chain MEP cathepsin L preproprotein
Type:
Enzyme
Mol. Mass.:
37557.19
Organism:
Homo sapiens (Human)
Description:
Purchased from Calbiochem (San Diego, CA).
Residue:
333
  
Inhibitor
Name:
BDBM50268444
Synonyms:
6-((3'-(dimethylamino)biphenyl-3-yl)methylamino)-9-(3-hydroxypropyl)-9H-purine-2-carbonitrile | CHEMBL495803
Type:
Small organic molecule
Emp. Form.:
C24H25N7O
Mol. Mass.:
427.5016
SMILES:
CN(C)c1cccc(c1)-c1cccc(CNc2nc(nc3n(CCCO)cnc23)C#N)c1
: