Target
5-hydroxytryptamine receptor 6
Ligand
BDBM50300830
Substrate
Meas. Tech.
ChEMBL_598758 (CHEMBL1040173)
Ki
4.2±n/a nM
Citation
 Bernotas, RCLenicek, SAntane, SCole, DCHarrison, BLRobichaud, AJZhang, GMSmith, DPlatt, BLin, QLi, PCoupet, JRosenzweig-Lipson, SBeyer, CESchechter, LE Novel 1-aminoethyl-3-arylsulfonyl-1H-pyrrolo[2,3-b]pyridines are potent 5-HT(6) agonists. Bioorg Med Chem 17:5153-63 (2009)  
Target
Name:
5-hydroxytryptamine receptor 6
Synonyms:
5-HT-6 5-hydroxytryptamine receptor 6 (5-HT-6) 5-hydroxytryptamine receptor 6 (5HT6) HTR6 Serotonin 6 (5-HT6) receptor | Serotonin Receptor 6
Type:
G Protein-Coupled Receptor (GPCR)
Mol. Mass.:
46968.43
Organism:
Homo sapiens (Human)
Description:
P50406
Residue:
440
  
Inhibitor
Name:
BDBM50300830
Synonyms:
2-[2-Methyl-3-(phenylsulfonyl)-1H-pyrrolo[2,3-b]pyridin-1-yl]ethylamine | CHEMBL577687
Type:
Small organic molecule
Emp. Form.:
C16H17N3O2S
Mol. Mass.:
315.39
SMILES:
Cc1c(c2cccnc2n1CCN)S(=O)(=O)c1ccccc1
: