Target
Tryptophan 5-hydroxylase 1
Ligand
BDBM50300934
Substrate
Meas. Tech.
ChEMBL_597945 (CHEMBL1042730)
IC50
24±n/a nM
Citation
 Jin, HCianchetta, GDevasagayaraj, AGu, KMarinelli, BSamala, LScott, SStouch, TTunoori, AWang, YZang, YZhang, CDavid Kimball, SMain, AJDing, ZMSun, WYang, QYu, XQPowell, DRWilson, ALiu, QShi, ZC Substituted 3-(4-(1,3,5-triazin-2-yl)-phenyl)-2-aminopropanoic acids as novel tryptophan hydroxylase inhibitors. Bioorg Med Chem Lett 19:5229-32 (2009)  
Target
Name:
Tryptophan 5-hydroxylase 1
Synonyms:
TPH TPH1_HUMAN TRPH | Tryptophan 5-monooxygenase 1
Type:
PROTEIN
Mol. Mass.:
50990.64
Organism:
Homo sapiens (Human)
Description:
ChEMBL_1361824
Residue:
444
  
Inhibitor
Name:
BDBM50300934
Synonyms:
(2S)-2-amino-3-(4-(4-amino-6-(1-(biphenyl-4-yl)ethylamino)-1,3,5-triazin-2-yl)phenyl)propanoic acid | CHEMBL569517
Type:
Small organic molecule
Emp. Form.:
C26H26N6O2
Mol. Mass.:
454.5236
SMILES:
CC(Nc1nc(N)nc(n1)-c1ccc(C[C@H](N)C(O)=O)cc1)c1ccc(cc1)-c1ccccc1
: