Target
Tryptophan 5-hydroxylase 1
Ligand
BDBM50300935
Substrate
Meas. Tech.
ChEMBL_597945 (CHEMBL1042730)
IC50
19±n/a nM
Citation
 Jin, HCianchetta, GDevasagayaraj, AGu, KMarinelli, BSamala, LScott, SStouch, TTunoori, AWang, YZang, YZhang, CDavid Kimball, SMain, AJDing, ZMSun, WYang, QYu, XQPowell, DRWilson, ALiu, QShi, ZC Substituted 3-(4-(1,3,5-triazin-2-yl)-phenyl)-2-aminopropanoic acids as novel tryptophan hydroxylase inhibitors. Bioorg Med Chem Lett 19:5229-32 (2009)  
Target
Name:
Tryptophan 5-hydroxylase 1
Synonyms:
TPH TPH1_HUMAN TRPH | Tryptophan 5-monooxygenase 1
Type:
PROTEIN
Mol. Mass.:
50990.64
Organism:
Homo sapiens (Human)
Description:
ChEMBL_1361824
Residue:
444
  
Inhibitor
Name:
BDBM50300935
Synonyms:
(S)-3-{4-[4-(1-Adamantan-1-yl-ethylamino)-6-amino-[1,3,5]triazin-2-yl]-phenyl}-2-amino-propionic acid | CHEMBL565307
Type:
Small organic molecule
Emp. Form.:
C24H32N6O2
Mol. Mass.:
436.5499
SMILES:
CC(Nc1nc(N)nc(n1)-c1ccc(C[C@H](N)C(O)=O)cc1)C12CC3CC(CC(C3)C1)C2
: