Target
Synaptic vesicular amine transporter
Ligand
BDBM50301022
Substrate
Meas. Tech.
ChEMBL_598158 (CHEMBL1044342)
Ki
0.24±n/a nM
Citation
 Zhu, LLiu, JKung, HF Synthesis and evaluation of 2-amino-dihydrotetrabenzine derivatives as probes for imaging vesicular monoamine transporter-2. Bioorg Med Chem Lett 19:5026-8 (2009)  
Target
Name:
Synaptic vesicular amine transporter
Synonyms:
Monoamine transporter Solute carrier family 18 member 2 Synaptic vesicular amine transporter VMAT2_RAT Vesicular monoamine transporter 2 (VMAT2) | Vmat2
Type:
Protein
Mol. Mass.:
55689.58
Organism:
Rattus norvegicus (Rat)
Description:
Q01827
Residue:
515
  
Inhibitor
Name:
BDBM50301022
Synonyms:
(+)-9-fluoropropyl-dihydrotetrabenazine | CHEMBL579217
Type:
Small organic molecule
Emp. Form.:
C21H32FNO3
Mol. Mass.:
365.4821
SMILES:
COc1cc2[C@H]3C[C@@H](O)[C@H](CC(C)C)CN3CCc2cc1OCCCF
: