Target
5-hydroxytryptamine receptor 2B
Ligand
BDBM50001915
Substrate
Meas. Tech.
ChEMBL_599277 (CHEMBL1041005)
EC50
125±n/a nM
Citation
 Brennan, PEWhitlock, GAHo, DKConlon, KMcMurray, G Discovery of a novel azepine series of potent and selective 5-HT2C agonists as potential treatments for urinary incontinence. Bioorg Med Chem Lett 19:4999-5003 (2009)  
Target
Name:
5-hydroxytryptamine receptor 2B
Synonyms:
5-HT-2B 5-hydroxytryptamine (serotonin) receptor 2B [Homo sapiens] 5-hydroxytryptamine receptor 2C (5HT2C) HTR2B Serotonin 2b (5-HT2b) receptor | Serotonin Receptor 2B
Type:
G Protein-Coupled Receptor (GPCR)
Mol. Mass.:
54312.47
Organism:
Homo sapiens (Human)
Description:
Receptor binding assays were performed using human clone stably expressed in CHO cells.
Residue:
481
  
Inhibitor
Name:
BDBM50001915
Synonyms:
1-(3-chlorophenyl)piperazine m-Chlorophenylpiperazine | mCPP
Type:
Small organic molecule
Emp. Form.:
C10H13ClN2
Mol. Mass.:
196.677
SMILES:
Clc1cccc(c1)N1CCNCC1
: