Target
C-X-C chemokine receptor type 3
Ligand
BDBM50301325
Substrate
Meas. Tech.
ChEMBL_599488 (CHEMBL1049024)
Ki
330±n/a nM
Citation
 McGuinness, BFCarroll, CDZawacki, LGDong, GYang, CHobbs, DWJacob-Samuel, BHall, JWJenh, CHKozlowski, JAAnilkumar, GNRosenblum, SB Novel CXCR3 antagonists with a piperazinyl-piperidine core. Bioorg Med Chem Lett 19:5205-8 (2009)  
Target
Name:
C-X-C chemokine receptor type 3
Synonyms:
AAO92295.1 C-X-C chemokine receptor type 3 (CXCR3) CXCR3 CXCR3_HUMAN chemokine (C-X-C motif) receptor 3
Type:
Enzyme Catalytic Domain
Mol. Mass.:
40665.65
Organism:
Homo sapiens (Human)
Description:
Residue:
368
  
Inhibitor
Name:
BDBM50301325
Synonyms:
3-chloro-4-(4-(1-(4-chlorobenzyl)piperidin-4-yl)piperazin-1-yl)-N-(3,4-dichlorobenzyl)benzamide | CHEMBL583655
Type:
Small organic molecule
Emp. Form.:
C30H32Cl4N4O
Mol. Mass.:
606.413
SMILES:
Clc1ccc(CN2CCC(CC2)N2CCN(CC2)c2ccc(cc2Cl)C(=O)NCc2ccc(Cl)c(Cl)c2)cc1
: