Target
C-X-C chemokine receptor type 3
Ligand
BDBM50301346
Substrate
Meas. Tech.
ChEMBL_599488 (CHEMBL1049024)
Ki
560±n/a nM
Citation
 McGuinness, BFCarroll, CDZawacki, LGDong, GYang, CHobbs, DWJacob-Samuel, BHall, JWJenh, CHKozlowski, JAAnilkumar, GNRosenblum, SB Novel CXCR3 antagonists with a piperazinyl-piperidine core. Bioorg Med Chem Lett 19:5205-8 (2009)  
Target
Name:
C-X-C chemokine receptor type 3
Synonyms:
AAO92295.1 C-X-C chemokine receptor type 3 (CXCR3) CXCR3 CXCR3_HUMAN chemokine (C-X-C motif) receptor 3
Type:
Enzyme Catalytic Domain
Mol. Mass.:
40665.65
Organism:
Homo sapiens (Human)
Description:
Residue:
368
  
Inhibitor
Name:
BDBM50301346
Synonyms:
5-chloro-6-(4-(1-(4-chlorobenzyl)piperidin-4-yl)piperazin-1-yl)-N-methylnicotinamide | CHEMBL565761
Type:
Small organic molecule
Emp. Form.:
C23H29Cl2N5O
Mol. Mass.:
462.415
SMILES:
CNC(=O)c1cnc(N2CCN(CC2)C2CCN(Cc3ccc(Cl)cc3)CC2)c(Cl)c1
: