Target
Plasminogen
Ligand
BDBM50301989
Substrate
Meas. Tech.
ChEMBL_599101 (CHEMBL1047156)
IC50
2100±n/a nM
Citation
 West, CWAdler, MArnaiz, DChen, DChu, KGualtieri, GHo, EHuwe, CLight, DPhillips, GPulk, RSukovich, DWhitlow, MYuan, SBryant, J Identification of orally bioavailable, non-amidine inhibitors of Urokinase Plasminogen Activator (uPA). Bioorg Med Chem Lett 19:5712-5 (2009)  
Target
Name:
Plasminogen
Synonyms:
Activation peptide PLG Plasmin Plasmin heavy chain A, short form | Plasmin light chain B
Type:
Enzyme
Mol. Mass.:
90579.18
Organism:
Homo sapiens (Human)
Description:
Residue:
810
  
Inhibitor
Name:
BDBM50301989
Synonyms:
2-(6-(3'-carbamimidoylbiphenyl-3-yloxy)-3,5-difluoro-4-methylpyridin-2-yloxy)-4-(dimethylamino)benzoic acid | CHEMBL571392
Type:
Small organic molecule
Emp. Form.:
C28H24F2N4O4
Mol. Mass.:
518.5114
SMILES:
CN(C)c1ccc(C(O)=O)c(Oc2nc(Oc3cccc(c3)-c3cccc(c3)C(N)=N)c(F)c(C)c2F)c1
: